I change the hadoop version to 2.6.0-cdh5.9.0,how to use mvn rebuild druid(0.10.1 )?

ad method call from inside of a branch

Exception Details:

Location:

io/druid/server/lookup/namespace/cache/CacheScheduler$Entry.(Lio/druid/server/lookup/namespace/cache/CacheScheduler;Lio/druid/query/lookup/namespace/ExtractionNamespace;Lio/druid/query/lookup/namespace/CacheGenerator;Lio/druid/server/lookup/namespace/cache/CacheScheduler$1;)V @55: invokespecial

Reason:

Error exists in the bytecode

Bytecode:

0x0000000: 2a2b 2c2d 3a08 3a07 3a06 3a05 1279 b800

0x0000010: 6f06 bd00 0459 0319 0653 5904 1907 5359

0x0000020: 0519 0853 12ec b800 35b8 00ef 3a0a 190a

0x0000030: b200 3fa5 000a 2ab7 0027 a700 1019 0519

0x0000040: 0619 0719 08b7 00f1 0157 b1

Stackmap Table:

full_frame(@61,{UninitializedThis,Object[#27],Object[#29],Object[#31],Object[#235],UninitializedThis,Object[#27],Object[#29],Object[#31],Top,Object[#4]},{})

full_frame(@74,{Object[#2],Object[#27],Object[#29],Object[#31],Object[#235],Object[#2],Object[#27],Object[#29],Object[#31],Top,Object[#4]},{})

at io.druid.query.lookup.NamespaceLookupExtractorFactoryTest.(NamespaceLookupExtractorFactoryTest.java:82)

testMissingSpec(io.druid.query.lookup.NamespaceLookupExtractorFactoryTest) Time elapsed: 0 sec <<< ERROR!

java.lang.VerifyError:

Bad method call from inside of a branch

Exception Details:

Location:

io/druid/server/lookup/namespace/cache/CacheScheduler$Entry.(Lio/druid/server/lookup/namespace/cache/CacheScheduler;Lio/druid/query/lookup/namespace/ExtractionNamespace;Lio/druid/query/lookup/namespace/CacheGenerator;Lio/druid/server/lookup/namespace/cache/CacheScheduler$1;)V @55: invokespecial

Reason:

Error exists in the bytecode

Bytecode:

0x0000000: 2a2b 2c2d 3a08 3a07 3a06 3a05 1279 b800

0x0000010: 6f06 bd00 0459 0319 0653 5904 1907 5359

0x0000020: 0519 0853 12ec b800 35b8 00ef 3a0a 190a

0x0000030: b200 3fa5 000a 2ab7 0027 a700 1019 0519

0x0000040: 0619 0719 08b7 00f1 0157 b1

Stackmap Table:

full_frame(@61,{UninitializedThis,Object[#27],Object[#29],Object[#31],Object[#235],UninitializedThis,Object[#27],Object[#29],Object[#31],Top,Object[#4]},{})

full_frame(@74,{Object[#2],Object[#27],Object[#29],Object[#31],Object[#235],Object[#2],Object[#27],Object[#29],Object[#31],Top,Object[#4]},{})

at io.druid.query.lookup.NamespaceLookupExtractorFactoryTest.(NamespaceLookupExtractorFactoryTest.java:82)

testSimpleStartStop(io.druid.query.lookup.NamespaceLookupExtractorFactoryTest) Time elapsed: 0 sec <<< ERROR!

java.lang.VerifyError:

Bad method call from inside of a branch

Exception Details:

Location:

io/druid/server/lookup/namespace/cache/CacheScheduler$Entry.(Lio/druid/server/lookup/namespace/cache/CacheScheduler;Lio/druid/query/lookup/namespace/ExtractionNamespace;Lio/druid/query/lookup/namespace/CacheGenerator;Lio/druid/server/lookup/namespace/cache/CacheScheduler$1;)V @55: invokespecial

Reason:

Error exists in the bytecode

Bytecode:

0x0000000: 2a2b 2c2d 3a08 3a07 3a06 3a05 1279 b800

0x0000010: 6f06 bd00 0459 0319 0653 5904 1907 5359

0x0000020: 0519 0853 12ec b800 35b8 00ef 3a0a 190a

0x0000030: b200 3fa5 000a 2ab7 0027 a700 1019 0519

0x0000040: 0619 0719 08b7 00f1 0157 b1

Stackmap Table:

full_frame(@61,{UninitializedThis,Object[#27],Object[#29],Object[#31],Object[#235],UninitializedThis,Object[#27],Object[#29],Object[#31],Top,Object[#4]},{})

full_frame(@74,{Object[#2],Object[#27],Object[#29],Object[#31],Object[#235],Object[#2],Object[#27],Object[#29],Object[#31],Top,Object[#4]},{})

at io.druid.query.lookup.NamespaceLookupExtractorFactoryTest.(NamespaceLookupExtractorFactoryTest.java:82)

testStartReturnsImmediately(io.druid.query.lookup.NamespaceLookupExtractorFactoryTest) Time elapsed: 0 sec <<< ERROR!

java.lang.VerifyError:

Bad method call from inside of a branch

Exception Details:

Location:

io/druid/server/lookup/namespace/cache/CacheScheduler$Entry.(Lio/druid/server/lookup/namespace/cache/CacheScheduler;Lio/druid/query/lookup/namespace/ExtractionNamespace;Lio/druid/query/lookup/namespace/CacheGenerator;Lio/druid/server/lookup/namespace/cache/CacheScheduler$1;)V @55: invokespecial

Reason:

Error exists in the bytecode

Bytecode:

0x0000000: 2a2b 2c2d 3a08 3a07 3a06 3a05 1279 b800

0x0000010: 6f06 bd00 0459 0319 0653 5904 1907 5359

0x0000020: 0519 0853 12ec b800 35b8 00ef 3a0a 190a

0x0000030: b200 3fa5 000a 2ab7 0027 a700 1019 0519

0x0000040: 0619 0719 08b7 00f1 0157 b1

Stackmap Table:

full_frame(@61,{UninitializedThis,Object[#27],Object[#29],Object[#31],Object[#235],UninitializedThis,Object[#27],Object[#29],Object[#31],Top,Object[#4]},{})

full_frame(@74,{Object[#2],Object[#27],Object[#29],Object[#31],Object[#235],Object[#2],Object[#27],Object[#29],Object[#31],Top,Object[#4]},{})

at io.druid.query.lookup.NamespaceLookupExtractorFactoryTest.(NamespaceLookupExtractorFactoryTest.java:82)

testStartReturnsImmediatelyAndFails(io.druid.query.lookup.NamespaceLookupExtractorFactoryTest) Time elapsed: 0 sec <<< ERROR!

java.lang.VerifyError:

Bad method call from inside of a branch

Exception Details:

Location:

io/druid/server/lookup/namespace/cache/CacheScheduler$Entry.(Lio/druid/server/lookup/namespace/cache/CacheScheduler;Lio/druid/query/lookup/namespace/ExtractionNamespace;Lio/druid/query/lookup/namespace/CacheGenerator;Lio/druid/server/lookup/namespace/cache/CacheScheduler$1;)V @55: invokespecial

Reason:

Error exists in the bytecode

Bytecode:

0x0000000: 2a2b 2c2d 3a08 3a07 3a06 3a05 1279 b800

0x0000010: 6f06 bd00 0459 0319 0653 5904 1907 5359

0x0000020: 0519 0853 12ec b800 35b8 00ef 3a0a 190a

0x0000030: b200 3fa5 000a 2ab7 0027 a700 1019 0519

0x0000040: 0619 0719 08b7 00f1 0157 b1

Stackmap Table:

full_frame(@61,{UninitializedThis,Object[#27],Object[#29],Object[#31],Object[#235],UninitializedThis,Object[#27],Object[#29],Object[#31],Top,Object[#4]},{})

full_frame(@74,{Object[#2],Object[#27],Object[#29],Object[#31],Object[#235],Object[#2],Object[#27],Object[#29],Object[#31],Top,Object[#4]},{})

at io.druid.query.lookup.NamespaceLookupExtractorFactoryTest.(NamespaceLookupExtractorFactoryTest.java:82)

testSimpleStartStopStop(io.druid.query.lookup.NamespaceLookupExtractorFactoryTest) Time elapsed: 0 sec <<< ERROR!

java.lang.VerifyError:

Bad method call from inside of a branch

Exception Details:

Location:

io/druid/server/lookup/namespace/cache/CacheScheduler$Entry.(Lio/druid/server/lookup/namespace/cache/CacheScheduler;Lio/druid/query/lookup/namespace/ExtractionNamespace;Lio/druid/query/lookup/namespace/CacheGenerator;Lio/druid/server/lookup/namespace/cache/CacheScheduler$1;)V @55: invokespecial

Reason:

Error exists in the bytecode

Bytecode:

0x0000000: 2a2b 2c2d 3a08 3a07 3a06 3a05 1279 b800

0x0000010: 6f06 bd00 0459 0319 0653 5904 1907 5359

0x0000020: 0519 0853 12ec b800 35b8 00ef 3a0a 190a

0x0000030: b200 3fa5 000a 2ab7 0027 a700 1019 0519

0x0000040: 0619 0719 08b7 00f1 0157 b1

Stackmap Table:

full_frame(@61,{UninitializedThis,Object[#27],Object[#29],Object[#31],Object[#235],UninitializedThis,Object[#27],Object[#29],Object[#31],Top,Object[#4]},{})

full_frame(@74,{Object[#2],Object[#27],Object[#29],Object[#31],Object[#235],Object[#2],Object[#27],Object[#29],Object[#31],Top,Object[#4]},{})

at io.druid.query.lookup.NamespaceLookupExtractorFactoryTest.(NamespaceLookupExtractorFactoryTest.java:82)

testSimpleStartStart(io.druid.query.lookup.NamespaceLookupExtractorFactoryTest) Time elapsed: 0 sec <<< ERROR!

java.lang.VerifyError:

Bad method call from inside of a branch

Exception Details:

Location:

io/druid/server/lookup/namespace/cache/CacheScheduler$Entry.(Lio/druid/server/lookup/namespace/cache/CacheScheduler;Lio/druid/query/lookup/namespace/ExtractionNamespace;Lio/druid/query/lookup/namespace/CacheGenerator;Lio/druid/server/lookup/namespace/cache/CacheScheduler$1;)V @55: invokespecial

Reason:

Error exists in the bytecode

Bytecode:

0x0000000: 2a2b 2c2d 3a08 3a07 3a06 3a05 1279 b800

0x0000010: 6f06 bd00 0459 0319 0653 5904 1907 5359

0x0000020: 0519 0853 12ec b800 35b8 00ef 3a0a 190a

0x0000030: b200 3fa5 000a 2ab7 0027 a700 1019 0519

0x0000040: 0619 0719 08b7 00f1 0157 b1

Stackmap Table:

full_frame(@61,{UninitializedThis,Object[#27],Object[#29],Object[#31],Object[#235],UninitializedThis,Object[#27],Object[#29],Object[#31],Top,Object[#4]},{})

full_frame(@74,{Object[#2],Object[#27],Object[#29],Object[#31],Object[#235],Object[#2],Object[#27],Object[#29],Object[#31],Top,Object[#4]},{})

at io.druid.query.lookup.NamespaceLookupExtractorFactoryTest.(NamespaceLookupExtractorFactoryTest.java:82)

testSimpleStartGetStop(io.druid.query.lookup.NamespaceLookupExtractorFactoryTest) Time elapsed: 0.001 sec <<< ERROR!

java.lang.VerifyError:

Bad method call from inside of a branch

Exception Details:

Location:

io/druid/server/lookup/namespace/cache/CacheScheduler$Entry.(Lio/druid/server/lookup/namespace/cache/CacheScheduler;Lio/druid/query/lookup/namespace/ExtractionNamespace;Lio/druid/query/lookup/namespace/CacheGenerator;Lio/druid/server/lookup/namespace/cache/CacheScheduler$1;)V @55: invokespecial

Reason:

Error exists in the bytecode

Bytecode:

0x0000000: 2a2b 2c2d 3a08 3a07 3a06 3a05 1279 b800

0x0000010: 6f06 bd00 0459 0319 0653 5904 1907 5359

0x0000020: 0519 0853 12ec b800 35b8 00ef 3a0a 190a

0x0000030: b200 3fa5 000a 2ab7 0027 a700 1019 0519

0x0000040: 0619 0719 08b7 00f1 0157 b1

Stackmap Table:

full_frame(@61,{UninitializedThis,Object[#27],Object[#29],Object[#31],Object[#235],UninitializedThis,Object[#27],Object[#29],Object[#31],Top,Object[#4]},{})

full_frame(@74,{Object[#2],Object[#27],Object[#29],Object[#31],Object[#235],Object[#2],Object[#27],Object[#29],Object[#31],Top,Object[#4]},{})

at io.druid.query.lookup.NamespaceLookupExtractorFactoryTest.(NamespaceLookupExtractorFactoryTest.java:82)

testSimpleStartRacyGetDuringDelete(io.druid.query.lookup.NamespaceLookupExtractorFactoryTest) Time elapsed: 0 sec <<< ERROR!

java.lang.VerifyError:

Bad method call from inside of a branch

Exception Details:

Location:

io/druid/server/lookup/namespace/cache/CacheScheduler$Entry.(Lio/druid/server/lookup/namespace/cache/CacheScheduler;Lio/druid/query/lookup/namespace/ExtractionNamespace;Lio/druid/query/lookup/namespace/CacheGenerator;Lio/druid/server/lookup/namespace/cache/CacheScheduler$1;)V @55: invokespecial

Reason:

Error exists in the bytecode

Bytecode:

0x0000000: 2a2b 2c2d 3a08 3a07 3a06 3a05 1279 b800

0x0000010: 6f06 bd00 0459 0319 0653 5904 1907 5359

0x0000020: 0519 0853 12ec b800 35b8 00ef 3a0a 190a

0x0000030: b200 3fa5 000a 2ab7 0027 a700 1019 0519

0x0000040: 0619 0719 08b7 00f1 0157 b1

Stackmap Table:

full_frame(@61,{UninitializedThis,Object[#27],Object[#29],Object[#31],Object[#235],UninitializedThis,Object[#27],Object[#29],Object[#31],Top,Object[#4]},{})

full_frame(@74,{Object[#2],Object[#27],Object[#29],Object[#31],Object[#235],Object[#2],Object[#27],Object[#29],Object[#31],Top,Object[#4]},{})

at io.druid.query.lookup.NamespaceLookupExtractorFactoryTest.(NamespaceLookupExtractorFactoryTest.java:82)

testStartFailsToSchedule(io.druid.query.lookup.NamespaceLookupExtractorFactoryTest) Time elapsed: 0 sec <<< ERROR!

java.lang.VerifyError:

Bad method call from inside of a branch

Exception Details:

Location:

io/druid/server/lookup/namespace/cache/CacheScheduler$Entry.(Lio/druid/server/lookup/namespace/cache/CacheScheduler;Lio/druid/query/lookup/namespace/ExtractionNamespace;Lio/druid/query/lookup/namespace/CacheGenerator;Lio/druid/server/lookup/namespace/cache/CacheScheduler$1;)V @55: invokespecial

Reason:

Error exists in the bytecode

Bytecode:

0x0000000: 2a2b 2c2d 3a08 3a07 3a06 3a05 1279 b800

0x0000010: 6f06 bd00 0459 0319 0653 5904 1907 5359

0x0000020: 0519 0853 12ec b800 35b8 00ef 3a0a 190a

0x0000030: b200 3fa5 000a 2ab7 0027 a700 1019 0519

0x0000040: 0619 0719 08b7 00f1 0157 b1

Stackmap Table:

full_frame(@61,{UninitializedThis,Object[#27],Object[#29],Object[#31],Object[#235],UninitializedThis,Object[#27],Object[#29],Object[#31],Top,Object[#4]},{})

full_frame(@74,{Object[#2],Object[#27],Object[#29],Object[#31],Object[#235],Object[#2],Object[#27],Object[#29],Object[#31],Top,Object[#4]},{})

at io.druid.query.lookup.NamespaceLookupExtractorFactoryTest.(NamespaceLookupExtractorFactoryTest.java:82)

testReplaces(io.druid.query.lookup.NamespaceLookupExtractorFactoryTest) Time elapsed: 0 sec <<< ERROR!

java.lang.VerifyError:

Bad method call from inside of a branch

Exception Details:

Location:

io/druid/server/lookup/namespace/cache/CacheScheduler$Entry.(Lio/druid/server/lookup/namespace/cache/CacheScheduler;Lio/druid/query/lookup/namespace/ExtractionNamespace;Lio/druid/query/lookup/namespace/CacheGenerator;Lio/druid/server/lookup/namespace/cache/CacheScheduler$1;)V @55: invokespecial

Reason:

Error exists in the bytecode

Bytecode:

0x0000000: 2a2b 2c2d 3a08 3a07 3a06 3a05 1279 b800

0x0000010: 6f06 bd00 0459 0319 0653 5904 1907 5359

0x0000020: 0519 0853 12ec b800 35b8 00ef 3a0a 190a

0x0000030: b200 3fa5 000a 2ab7 0027 a700 1019 0519

0x0000040: 0619 0719 08b7 00f1 0157 b1

Stackmap Table:

full_frame(@61,{UninitializedThis,Object[#27],Object[#29],Object[#31],Object[#235],UninitializedThis,Object[#27],Object[#29],Object[#31],Top,Object[#4]},{})

full_frame(@74,{Object[#2],Object[#27],Object[#29],Object[#31],Object[#235],Object[#2],Object[#27],Object[#29],Object[#31],Top,Object[#4]},{})

at io.druid.query.lookup.NamespaceLookupExtractorFactoryTest.(NamespaceLookupExtractorFactoryTest.java:82)

testMustBeStarted(io.druid.query.lookup.NamespaceLookupExtractorFactoryTest) Time elapsed: 0 sec <<< ERROR!

java.lang.VerifyError:

Bad method call from inside of a branch

Exception Details:

Location:

io/druid/server/lookup/namespace/cache/CacheScheduler$Entry.(Lio/druid/server/lookup/namespace/cache/CacheScheduler;Lio/druid/query/lookup/namespace/ExtractionNamespace;Lio/druid/query/lookup/namespace/CacheGenerator;Lio/druid/server/lookup/namespace/cache/CacheScheduler$1;)V @55: invokespecial

Reason:

Error exists in the bytecode

Bytecode:

0x0000000: 2a2b 2c2d 3a08 3a07 3a06 3a05 1279 b800

0x0000010: 6f06 bd00 0459 0319 0653 5904 1907 5359

0x0000020: 0519 0853 12ec b800 35b8 00ef 3a0a 190a

0x0000030: b200 3fa5 000a 2ab7 0027 a700 1019 0519

0x0000040: 0619 0719 08b7 00f1 0157 b1

Stackmap Table:

full_frame(@61,{UninitializedThis,Object[#27],Object[#29],Object[#31],Object[#235],UninitializedThis,Object[#27],Object[#29],Object[#31],Top,Object[#4]},{})

full_frame(@74,{Object[#2],Object[#27],Object[#29],Object[#31],Object[#235],Object[#2],Object[#27],Object[#29],Object[#31],Top,Object[#4]},{})

at io.druid.query.lookup.NamespaceLookupExtractorFactoryTest.(NamespaceLookupExtractorFactoryTest.java:82)

testSerDe(io.druid.query.lookup.NamespaceLookupExtractorFactoryTest) Time elapsed: 0 sec <<< ERROR!

java.lang.VerifyError:

Bad method call from inside of a branch

Exception Details:

Location:

io/druid/server/lookup/namespace/cache/CacheScheduler$Entry.(Lio/druid/server/lookup/namespace/cache/CacheScheduler;Lio/druid/query/lookup/namespace/ExtractionNamespace;Lio/druid/query/lookup/namespace/CacheGenerator;Lio/druid/server/lookup/namespace/cache/CacheScheduler$1;)V @55: invokespecial

Reason:

Error exists in the bytecode

Bytecode:

0x0000000: 2a2b 2c2d 3a08 3a07 3a06 3a05 1279 b800

0x0000010: 6f06 bd00 0459 0319 0653 5904 1907 5359

0x0000020: 0519 0853 12ec b800 35b8 00ef 3a0a 190a

0x0000030: b200 3fa5 000a 2ab7 0027 a700 1019 0519

0x0000040: 0619 0719 08b7 00f1 0157 b1

Stackmap Table:

full_frame(@61,{UninitializedThis,Object[#27],Object[#29],Object[#31],Object[#235],UninitializedThis,Object[#27],Object[#29],Object[#31],Top,Object[#4]},{})

full_frame(@74,{Object[#2],Object[#27],Object[#29],Object[#31],Object[#235],Object[#2],Object[#27],Object[#29],Object[#31],Top,Object[#4]},{})

at io.druid.query.lookup.NamespaceLookupExtractorFactoryTest.(NamespaceLookupExtractorFactoryTest.java:82)

testSimpleIntrospectionHandler(io.druid.query.lookup.NamespaceLookupExtractorFactoryTest) Time elapsed: 0 sec <<< ERROR!

java.lang.VerifyError:

Bad method call from inside of a branch

Exception Details:

Location:

io/druid/server/lookup/namespace/cache/CacheScheduler$Entry.(Lio/druid/server/lookup/namespace/cache/CacheScheduler;Lio/druid/query/lookup/namespace/ExtractionNamespace;Lio/druid/query/lookup/namespace/CacheGenerator;Lio/druid/server/lookup/namespace/cache/CacheScheduler$1;)V @55: invokespecial

Reason:

Error exists in the bytecode

Bytecode:

0x0000000: 2a2b 2c2d 3a08 3a07 3a06 3a05 1279 b800

0x0000010: 6f06 bd00 0459 0319 0653 5904 1907 5359

0x0000020: 0519 0853 12ec b800 35b8 00ef 3a0a 190a

0x0000030: b200 3fa5 000a 2ab7 0027 a700 1019 0519

0x0000040: 0619 0719 08b7 00f1 0157 b1

Stackmap Table:

full_frame(@61,{UninitializedThis,Object[#27],Object[#29],Object[#31],Object[#235],UninitializedThis,Object[#27],Object[#29],Object[#31],Top,Object[#4]},{})

full_frame(@74,{Object[#2],Object[#27],Object[#29],Object[#31],Object[#235],Object[#2],Object[#27],Object[#29],Object[#31],Top,Object[#4]},{})

at io.druid.query.lookup.NamespaceLookupExtractorFactoryTest.(NamespaceLookupExtractorFactoryTest.java:82)

testSingletonCacheScheduler(io.druid.query.lookup.NamespaceLookupExtractorFactoryTest) Time elapsed: 0 sec <<< ERROR!

java.lang.VerifyError:

Bad method call from inside of a branch

Exception Details:

Location:

io/druid/server/lookup/namespace/cache/CacheScheduler$Entry.(Lio/druid/server/lookup/namespace/cache/CacheScheduler;Lio/druid/query/lookup/namespace/ExtractionNamespace;Lio/druid/query/lookup/namespace/CacheGenerator;Lio/druid/server/lookup/namespace/cache/CacheScheduler$1;)V @55: invokespecial

Reason:

Error exists in the bytecode

Bytecode:

0x0000000: 2a2b 2c2d 3a08 3a07 3a06 3a05 1279 b800

0x0000010: 6f06 bd00 0459 0319 0653 5904 1907 5359

0x0000020: 0519 0853 12ec b800 35b8 00ef 3a0a 190a

0x0000030: b200 3fa5 000a 2ab7 0027 a700 1019 0519

0x0000040: 0619 0719 08b7 00f1 0157 b1

Stackmap Table:

full_frame(@61,{UninitializedThis,Object[#27],Object[#29],Object[#31],Object[#235],UninitializedThis,Object[#27],Object[#29],Object[#31],Top,Object[#4]},{})

full_frame(@74,{Object[#2],Object[#27],Object[#29],Object[#31],Object[#235],Object[#2],Object[#27],Object[#29],Object[#31],Top,Object[#4]},{})

at io.druid.query.lookup.NamespaceLookupExtractorFactoryTest.(NamespaceLookupExtractorFactoryTest.java:82)

testExceptionalIntrospectionHandler(io.druid.query.lookup.NamespaceLookupExtractorFactoryTest) Time elapsed: 0 sec <<< ERROR!

java.lang.VerifyError:

Bad method call from inside of a branch

Exception Details:

Location:

io/druid/server/lookup/namespace/cache/CacheScheduler$Entry.(Lio/druid/server/lookup/namespace/cache/CacheScheduler;Lio/druid/query/lookup/namespace/ExtractionNamespace;Lio/druid/query/lookup/namespace/CacheGenerator;Lio/druid/server/lookup/namespace/cache/CacheScheduler$1;)V @55: invokespecial

Reason:

Error exists in the bytecode

Bytecode:

0x0000000: 2a2b 2c2d 3a08 3a07 3a06 3a05 1279 b800

0x0000010: 6f06 bd00 0459 0319 0653 5904 1907 5359

0x0000020: 0519 0853 12ec b800 35b8 00ef 3a0a 190a

0x0000030: b200 3fa5 000a 2ab7 0027 a700 1019 0519

0x0000040: 0619 0719 08b7 00f1 0157 b1

Stackmap Table:

full_frame(@61,{UninitializedThis,Object[#27],Object[#29],Object[#31],Object[#235],UninitializedThis,Object[#27],Object[#29],Object[#31],Top,Object[#4]},{})

full_frame(@74,{Object[#2],Object[#27],Object[#29],Object[#31],Object[#235],Object[#2],Object[#27],Object[#29],Object[#31],Top,Object[#4]},{})

at io.druid.query.lookup.NamespaceLookupExtractorFactoryTest.(NamespaceLookupExtractorFactoryTest.java:82)

Results :

Tests in error:

NamespaceLookupExtractorFactoryTest.:82 » Verify Bad method call …

NamespaceLookupExtractorFactoryTest.:82 » Verify Bad method call …

NamespaceLookupExtractorFactoryTest.:82 » Verify Bad method call …

NamespaceLookupExtractorFactoryTest.:82 » Verify Bad method call …

NamespaceLookupExtractorFactoryTest.:82 » Verify Bad method call …

NamespaceLookupExtractorFactoryTest.:82 » Verify Bad method call …

NamespaceLookupExtractorFactoryTest.:82 » Verify Bad method call …

NamespaceLookupExtractorFactoryTest.:82 » Verify Bad method call …

NamespaceLookupExtractorFactoryTest.:82 » Verify Bad method call …

NamespaceLookupExtractorFactoryTest.:82 » Verify Bad method call …

NamespaceLookupExtractorFactoryTest.:82 » Verify Bad method call …

NamespaceLookupExtractorFactoryTest.:82 » Verify Bad method call …

NamespaceLookupExtractorFactoryTest.:82 » Verify Bad method call …

NamespaceLookupExtractorFactoryTest.:82 » Verify Bad method call …

NamespaceLookupExtractorFactoryTest.:82 » Verify Bad method call …

NamespaceLookupExtractorFactoryTest.:82 » Verify Bad method call …

Tests run: 118, Failures: 0, Errors: 16, Skipped: 0

[INFO] ------------------------------------------------------------------------

[INFO] Reactor Summary:

[INFO]

[INFO] io.druid:druid … SUCCESS [ 2.461 s]

[INFO] java-util … SUCCESS [ 11.613 s]

[INFO] druid-api … SUCCESS [ 7.482 s]

[INFO] druid-common … SUCCESS [ 15.380 s]

[INFO] druid-hll … SUCCESS [ 3.580 s]

[INFO] extendedset … SUCCESS [ 59.269 s]

[INFO] bytebuffer-collections … SUCCESS [ 4.218 s]

[INFO] druid-processing … SUCCESS [06:28 min]

[INFO] druid-aws-common … SUCCESS [ 1.814 s]

[INFO] druid-server … SUCCESS [03:08 min]

[INFO] druid-examples … SUCCESS [ 4.016 s]

[INFO] druid-indexing-hadoop … SUCCESS [01:15 min]

[INFO] druid-indexing-service … SUCCESS [01:50 min]

[INFO] druid-sql … SUCCESS [ 32.822 s]

[INFO] druid-services … SUCCESS [ 34.280 s]

[INFO] druid-s3-extensions … SUCCESS [ 6.946 s]

[INFO] druid-datasketches … SUCCESS [ 17.746 s]

[INFO] druid-kafka-eight … SUCCESS [ 1.448 s]

[INFO] druid-histogram … SUCCESS [ 15.667 s]

[INFO] mysql-metadata-storage … SUCCESS [ 2.903 s]

[INFO] druid-kafka-indexing-service … SUCCESS [02:38 min]

[INFO] druid-integration-tests … SUCCESS [ 6.598 s]

[INFO] druid-benchmarks … SUCCESS [ 24.453 s]

[INFO] druid-avro-extensions … SUCCESS [ 12.073 s]

[INFO] druid-caffeine-cache … SUCCESS [ 9.951 s]

[INFO] druid-kerberos … SUCCESS [ 5.631 s]

[INFO] druid-hdfs-storage … SUCCESS [ 21.728 s]

[INFO] druid-stats … SUCCESS [ 7.900 s]

[INFO] druid-lookups-cached-global … FAILURE [ 44.729 s]

[INFO] druid-kafka-extraction-namespace … SKIPPED

[INFO] postgresql-metadata-storage … SKIPPED

[INFO] druid-protobuf-extensions … SKIPPED

[INFO] druid-lookups-cached-single … SKIPPED

[INFO] druid-azure-extensions … SKIPPED

[INFO] druid-cassandra-storage … SKIPPED

[INFO] druid-rocketmq … SKIPPED

[INFO] druid-cloudfiles-extensions … SKIPPED

[INFO] graphite-emitter … SKIPPED

[INFO] druid-kafka-eight-simple-consumer … SKIPPED

[INFO] druid-rabbitmq … SKIPPED

[INFO] druid-distinctcount … SKIPPED

[INFO] druid-parquet-extensions … SKIPPED

[INFO] statsd-emitter … SKIPPED

[INFO] druid-orc-extensions … SKIPPED

[INFO] druid-time-min-max … SKIPPED

[INFO] druid-google-extensions … SKIPPED

[INFO] druid-virtual-columns … SKIPPED

[INFO] druid-thrift-extensions … SKIPPED

[INFO] ambari-metrics-emitter … SKIPPED

[INFO] scan-query … SKIPPED

[INFO] sqlserver-metadata-storage … SKIPPED

[INFO] kafka-emitter … SKIPPED

[INFO] distribution … SKIPPED

[INFO] ------------------------------------------------------------------------

[INFO] BUILD FAILURE

[INFO] ------------------------------------------------------------------------

[INFO] Total time: 21:16 min

[INFO] Finished at: 2017-11-06T10:43:08+08:00

[INFO] Final Memory: 313M/4359M

[INFO] ------------------------------------------------------------------------

[ERROR] Failed to execute goal org.apache.maven.plugins:maven-surefire-plugin:2.19.1:test (default-test) on project druid-lookups-cached-global: There are test failures.

[ERROR]

[ERROR] Please refer to /data/home/sxy/druid/druid-druid-0.10.1/extensions-core/lookups-cached-global/target/surefire-reports for the individual test results.

[ERROR] -> [Help 1]

[ERROR]

[ERROR] To see the full stack trace of the errors, re-run Maven with the -e switch.

[ERROR] Re-run Maven using the -X switch to enable full debug logging.

[ERROR]

[ERROR] For more information about the errors and possible solutions, please read the following articles